{"text_format":"1","workbook":"xlsx","n_sheets":17,"sheets":["Summary","A_Word","Well_Names","PRD_Profile_Gas","ADV_Profile_Gas","FRAC_Summary","DIR_SURVEY","Drilling_Events","FRAC_Descriptions","GAS_ANAL","ABANDON","CASINGS","PAY_ZONE","CODES","DBS_Location","Source","Search"],"not_rendered":{"charts":4,"images":1,"macros":1,"external_links":0,"defined_names":25,"comments":0,"pivot_tables":0},"unopened":[],"bounds":{"document_bytes":16777216,"sheet_cells":100000,"rows_first":2000,"rows_last":500,"rows_between":2000,"halvings":0,"cell_chars":16384,"cell_head_chars":4096},"cells_cut":0,"cells_raw":0,"read":"whole","date_system":"1900"}

{"sheet":"Summary","index":0,"n_rows":102,"n_cols":90,"rows_kept":102,"cut":false,"hidden":false,"merged":[[0,20,0,32],[0,55,0,57],[1,4,1,5],[4,12,4,14],[4,16,4,17],[1,32,10,32],[1,55,1,57],[2,3,2,8],[5,12,5,14],[10,12,10,14],[4,4,4,5],[4,7,4,8],[0,9,0,10],[0,12,0,18],[4,62,4,68],[5,0,6,1],[11,12,12,14],[8,12,8,14],[8,16,8,17],[9,12,9,14],[9,16,9,17],[5,16,5,17],[2,55,2,57],[6,12,6,14],[6,16,6,17],[3,55,3,57],[6,7,6,8],[7,12,7,14],[7,16,7,17],[6,4,6,5],[7,4,7,5],[7,7,7,8],[5,4,5,8],[14,20,14,32],[36,0,37,1],[36,17,36,18],[30,20,30,32],[41,0,42,1],[16,4,16,5],[17,7,17,8],[17,15,17,17],[18,0,19,0],[18,15,18,17],[19,13,19,14],[19,15,19,17],[20,0,21,1],[14,1,14,5],[15,15,15,17],[16,1,16,2],[17,4,17,5],[16,7,16,8],[16,15,16,17],[18,4,18,5],[50,0,51,0],[50,1,51,1],[50,2,51,2],[50,3,51,18],[44,20,44,32],[52,0,53,0],[52,1,53,1],[52,2,53,2],[52,3,53,18],[45,3,45,6],[46,0,47,0],[46,1,47,1],[46,2,47,2],[46,3,47,18],[48,0,49,0],[48,1,49,1],[48,2,49,2],[48,3,49,18],[54,0,55,0],[54,1,55,1],[54,2,55,2],[54,3,55,18],[56,0,57,1],[61,0,62,0],[61,1,62,1],[61,2,62,2],[61,3,62,3],[61,4,62,4],[61,11,62,18],[61,5,62,5],[61,6,62,6],[61,7,62,7],[61,8,62,8],[61,9,62,9],[61,10,62,10],[63,9,64,9],[63,10,64,10],[63,11,64,18],[65,0,66,0],[65,1,66,1],[65,2,66,2],[65,3,66,3],[65,4,66,4],[65,5,66,5],[65,6,66,6],[65,7,66,7],[65,8,66,8],[65,9,66,9],[65,10,66,10],[65,11,66,18],[63,0,64,0],[63,1,64,1],[63,2,64,2],[63,3,64,3],[63,4,64,4],[63,5,64,5],[63,6,64,6],[63,7,64,7],[63,8,64,8],[67,11,68,18],[69,0,70,0],[69,1,70,1],[69,2,70,2],[69,3,70,3],[69,4,70,4],[69,5,70,5],[69,6,70,6],[69,7,70,7],[69,8,70,8],[67,5,68,5],[67,6,68,6],[67,7,68,7],[67,8,68,8],[67,9,68,9],[67,10,68,10],[69,9,70,9],[67,0,68,0],[67,1,68,1],[67,2,68,2],[67,3,68,3],[67,4,68,4],[69,10,70,10],[69,11,70,18],[78,6,79,6],[78,7,79,7],[78,8,79,8],[78,9,79,9],[78,10,79,10],[78,11,79,18],[78,0,79,0],[78,1,79,1],[78,2,79,2],[78,3,79,3],[78,4,79,4],[78,5,79,5],[76,5,77,5],[76,6,77,6],[76,7,77,7],[76,8,77,8],[76,9,77,9],[76,10,77,10],[76,11,77,18],[71,0,72,1],[76,0,77,0],[76,1,77,1],[76,2,77,2],[76,3,77,3],[76,4,77,4],[80,6,81,6],[80,7,81,7],[80,8,81,8],[80,9,81,9],[80,10,81,10],[80,11,81,18],[80,0,81,0],[80,1,81,1],[80,2,81,2],[80,3,81,3],[80,4,81,4],[80,5,81,5],[82,6,83,6],[82,7,83,7],[82,8,83,8],[82,9,83,9],[82,10,83,10],[82,11,83,18],[82,0,83,0],[82,1,83,1],[82,2,83,2],[82,3,83,3],[82,4,83,4],[82,5,83,5],[84,6,85,6],[84,7,85,7],[84,8,85,8],[84,9,85,9],[84,10,85,10],[84,11,85,18],[84,0,85,0],[84,1,85,1],[84,2,85,2],[84,3,85,3],[84,4,85,4],[84,5,85,5]]}
[null,null,"Search Criteria",null,null,null,null,null,"Order by","High 3 Yr Prod",null,null,"New Feature - Order Selection Presentation by WA or Gas Production",null,null,null,null,null,null,null,{"$f":"\"Average Daily Volume of Gas Prodn - All Zones - \"&$B$20&\" - First Five Years\"","v":"Average Daily Volume of Gas Prodn - All Zones - 000 MCF - First Five Years"},null,null,null,null,null,null,null,null,null,null,null,null,null,null,null,null,{"$f":"IF($B$4=\"\",FALSE,TRUE)","v":false},null,null,null,null,null,null,null,null,null,null,null,null,null,null,null,"Find - Area",{"$f":"IF($BB$2=\"\",\"\",VLOOKUP(VLOOKUP($BB$2,LU_Area_Name,3),LU_Area_Name_No,3))","v":9021},{"$f":"IF($BB$2=\"\",\"\",VLOOKUP(VLOOKUP($BB$2,LU_Area_Name,3),LU_Area_Name_No,2))","v":"HERITAGE"},null,null,null,"Highest WA",null,null,"Well Name =",{"$f":"DGET(DB_WELL_NAME,\"WELL_NAME\",$BB$36:$BB$37)","v":"TOURMALINE  HZ TOWN C-G002-G/094-B-16"},null,null,null,null,null,null,null,null,null,null,"° ","' ","\"",null,"YES","Well_Name","Well_No"]
[null,null,null,"(2)  Select","First 25 Wells",null,{"$f":"IF(Search!$D$25>=501,\"<== Only First 500 of \"&Search!$E$25&\" Can be Selected\",\"of \"&Search!$E$25&\" Matching Below\")","v":"of 181 Matching Below"},null,null,{"$f":"IF(Search!$G$27=\"\",\"\",Search!$G$27)","v":""},null,null,"Current to:",{"$f":"Source!$E$2","v":"November 2025"},null,null,null,null,null,null,null,null,null,null,null,null,null,null,null,null,null,null,null,null,null,null,null,{"$f":"IF(Search!$G$27=\"\",FALSE,TRUE)","v":false},null,null,null,null,null,null,null,null,null,null,null,null,null,null,null,"HERITAGE",null,null,null,null,null,"Lowest WA",null,null,"Well Number =",{"$f":"IF(AND(ISNUMBER($AL$4),$AL$4>0,$AL$4<=Well_Names!$K$1),$AL$4,VLOOKUP($D$3,LU_Search_Summary_1,2,0))","v":49886},null,null,null,null,null,null,null,null,null,null,{"$f":"DGET(DB_WELL_NAME,\"SURF_LAT_CALC\",$BB$36:$BB$37)","v":57.396388999999999},null,{"$f":"IF(ISERROR($BW2),\"\",CJ2&$BW$1&CK2&$BX$1&CL2&$BY$1)","v":"57° 23' 47\""},null,"NO",{"$f":"Search!$C1","v":"49886 - TOURMALINE  HZ TOWN C-G002-G/094-B-16"},{"$f":"Search!$B1","v":49886},null,{"$f":"\"First \"&IF(Search!$D$25=1,\"\",MIN(25,Search!$D$25))&IF(Search!$D$25=1,\"Well\",\" Wells\")","v":"First 25 Wells"},"2015-2019","Horiz or Vert Wells",null,null,{"$f":"FLOOR(BW2,1)","v":57},{"$f":"FLOOR((BW2-CJ2)*60,1)","v":23},{"$f":"ROUND((BW2-(CJ2+CK2/60))*3600,2)","v":47}]
[null,null,null,"49886 - TOURMALINE  HZ TOWN C-G002-G/094-B-16",null,null,null,null,null,{"$f":"IF(Search!$G$28=\"\",\"\",Search!$G$28&\"                                                \")","v":""},null,null,null,null,null,null,null,null,null,null,null,null,null,null,null,null,null,null,null,null,null,null,null,null,null,null,null,null,null,null,null,null,null,null,null,null,null,null,null,null,null,null,null,"Find - Form'n",{"$f":"IF($BB$4=\"\",\"\",VLOOKUP(VLOOKUP($BB$4,LU_Formation_Name,3),LU_Formation_Name_No,3))","v":5000},{"$f":"IF($BB$4=\"\",\"\",VLOOKUP(VLOOKUP($BB$4,LU_Formation_Name,3),LU_Formation_Name_No,2))","v":"MONTNEY"},null,null,null,"High 3 Yr Prod",null,null,"Operator",{"$f":"DGET(DB_WELL_NAME,\"OPERATOR\",$BB$36:$BB$37)","v":"Tourmaline Oil Corp."},null,null,null,null,null,null,null,null,null,null,{"$f":"DGET(DB_WELL_NAME,\"SURF_LON_CALC\",$BB$36:$BB$37)","v":-123.681389},null,{"$f":"\"- \"&IF(ISERROR($BW3),\"\",CJ3&$BW$1&CK3&$BX$1&CL3&$BY$1)","v":"- 123° 40' 53\""},null,null,{"$f":"Search!$C2","v":"34329 - TOURMALINE  HZ NIG CREEK WEST A- 073-D/094-H-04"},{"$f":"Search!$B2","v":34329},null,{"$f":"IF(Search!$D$25<=25,\"\",\"Wells 26-\"&MIN(50,Search!$D$25)&\"\")","v":"Wells 26-50"},"2010-2014","Horiz Wells Only",null,null,{"$f":"FLOOR(ABS(BW3),1)","v":123},{"$f":"FLOOR((ABS(BW3)-CJ3)*60,1)","v":40},{"$f":"ROUND((ABS(BW3)-(CJ3+CK3/60))*3600,2)","v":53}]
["(1) Well No.",null,"Or","Search Parameters",null,null,null,null,null,null,null,null,"Location of Activity",null,null,null,null,null,null,null,null,null,null,null,null,null,null,null,null,null,null,null,null,null,null,null,null,{"$f":"IF($AL$1,VALUE($B$4),VALUE(IF(MID($D$3,1,1)=\" \",0,IF(MID($D$3,5,1)=\" \",MID($D$3,1,4),IF(MID($D$3,6,1)=\" \",MID($D$3,1,5))))))","v":49886},null,{"$f":"MID($D$3,1,5)","v":"49886"},null,null,null,null,null,null,null,null,null,null,null,null,null,"MONTNEY",null,null,null,null,null,"High 5 Yr Prod",null,null,null,null,null,null,null,null,"000 M3",null,null,null,null,null,"Spud Date",{"$f":"DGET(DB_WELL_NAME,\"SPUD_MON\",$BB$36:$BB$37)","v":202408},{"$f":"IF(ISERROR($BX4),\"\",DATE(LEFT($BX4,4),RIGHT(LEFT($BX4,6),2),1))","v":"2024-08-01"},null,null,{"$f":"Search!$C3","v":"34330 - TOURMALINE  HZ NIG CREEK WEST A-A073-D/094-H-04"},{"$f":"Search!$B3","v":34330},null,{"$f":"IF(Search!$D$25<=50,\"\",\"Wells 51-\"&MIN(75,Search!$D$25)&\"\")","v":"Wells 51-75"},"2007-2009","Vert Wells Only"]
[null,null,null,"Well Auth. No. from",null,null,"to",null,null,null,null,null,"Unique Well ID (UWI)",null,null,"Area","Formation",null,null,null,null,null,null,null,null,null,null,null,null,null,null,null,null,null,null,null,null,null,null,null,null,null,null,null,null,null,null,null,null,null,null,null,null,null,null,null,null,null,null,null,null,null,"Average Daily Volume of Production",null,null,null,null,null,null,"Production",null,null,{"$error":"#N/A"},null,"Rig Release Date",{"$f":"DGET(DB_WELL_NAME,\"RIG_REL_MON\",$BB$36:$BB$37)","v":202404},{"$f":"IF(ISERROR($BX5),\"\",DATE(LEFT($BX5,4),RIGHT(LEFT($BX5,6),2),1))","v":"2024-04-01"},null,null,{"$f":"Search!$C4","v":"36126 - TOURMALINE  HZ AITKEN CREEK NORTH C- 065-D/094-H-04"},{"$f":"Search!$B4","v":36126},null,{"$f":"IF(Search!$D$25<=75,\"\",\"Wells 76-\"&MIN(100,Search!$D$25)&\"\")","v":"Wells 76-100"},"2004-2006"]
["Enter text in rose coloured cells only.  Other cells may be locked.",null,null,"Well Name contains",null,null,null,null,null,null,null,null,{"$f":"IF(ISERROR(DGET(DB_ADV_Profile_Gas,\"UWI\",$BU$7:$BV$8)),\"\",DGET(DB_ADV_Profile_Gas,\"UWI\",$BU$7:$BV$8))","v":"207B090A094B1600"},null,null,{"$f":"IF(ISERROR(DGET(DB_ADV_Profile_Gas,\"AREA_CODE\",$BU$7:$BV$8)),\"\",VLOOKUP(DGET(DB_ADV_Profile_Gas,\"AREA_CODE\",$BU$7:$BV$8),LU_AREA_CODE,2,0))","v":"NORTHERN MONTNEY"},{"$f":"IF(ISERROR(DGET(DB_ADV_Profile_Gas,\"FORMTN_CODE\",$BU$7:$BV$8)),\"\",VLOOKUP(DGET(DB_ADV_Profile_Gas,\"FORMTN_CODE\",$BU$7:$BV$8),LU_FORM_CODE,2,0))","v":"MONTNEY"},null,null,null,null,null,null,null,null,null,null,null,null,null,null,null,null,null,null,null,null,null,null,null,null,null,null,null,null,null,null,null,null,null,null,null,null,null,null,null,null,null,null,null,null,null,"UWI 1","UWI 2","UWI 3","UWI 4","UWI 5","UWI 6","Total",null,null,null,null,null,"First Production",{"$f":"DGET(DB_WELL_NAME,\"First_Prod_Mon\",$BB$36:$BB$37)","v":{"$error":"#VALUE!"}},{"$f":"IF(ISERROR($BX6),\"\",DATE(LEFT($BX6,4),RIGHT(LEFT($BX6,6),2),1))","v":""},null,null,{"$f":"Search!$C5","v":"34331 - TOURMALINE  HZ NIG CREEK WEST A-B073-D/094-H-04"},{"$f":"Search!$B5","v":34331},null,{"$f":"IF(Search!$D$25<=100,\"\",\"Wells 101-\"&MIN(125,Search!$D$25)&\"\")","v":"Wells 101-125"},"2001-2003"]
{"$rows_left_out":97}
{"sheet":"A_Word","index":1,"n_rows":23,"n_cols":2,"rows_kept":23,"cut":false,"hidden":false,"merged":[[3,0,5,19],[7,0,9,19],[15,0,17,4],[11,0,13,19]]}
[]
["A Few Words (and Legal Stuff)"]
[]
["The data presented in this workbook is publicly available from the British Columbia Energy Regulator (BCER) website (www.bc-er.ca).  The BCER provides this data to industry and members of the public.  We are not aware of any restrictions that the BCER has placed upon the use of its data, but the BCER should be appropriately credited when information from its website (or summarized in this workbook and accompanying Access database) is cited."]
[]
[]
{"$rows_left_out":18}
{"sheet":"Well_Names","index":2,"n_rows":2,"n_cols":14,"rows_kept":2,"cut":false,"hidden":false,"merged":[]}
["WA_NUM","WELL_NAME","OPERATOR","Spud_Mon","Rig_Rel_Mon","First_Prod_Mon","Area","Area_DESC","Form","Form_DESC","HORIZ_WELL","GRID","SURF_LAT_CALC","SURF_LON_CALC"]
[49886,"TOURMALINE  HZ TOWN C-G002-G/094-B-16","Tourmaline Oil Corp.",202408,202404,null,9022,"NORTHERN MONTNEY",5000,"MONTNEY","HZ",null,57.396388999999999,-123.681389]

{"sheet":"PRD_Profile_Gas","index":3,"n_rows":2,"n_cols":133,"rows_kept":2,"cut":false,"hidden":false,"merged":[]}
["WA_NUM","FIRST_PROD_PERIOD","MPRD_001","MPRD_002","MPRD_003","MPRD_004","MPRD_005","MPRD_006","MPRD_007","MPRD_008","MPRD_009","MPRD_010","MPRD_011","MPRD_012","MPRD_013","MPRD_014","MPRD_015","MPRD_016","MPRD_017","MPRD_018","MPRD_019","MPRD_020","MPRD_021","MPRD_022","MPRD_023","MPRD_024","MPRD_025","MPRD_026","MPRD_027","MPRD_028","MPRD_029","MPRD_030","MPRD_031","MPRD_032","MPRD_033","MPRD_034","MPRD_035","MPRD_036","MPRD_037","MPRD_038","MPRD_039","MPRD_040","MPRD_041","MPRD_042","MPRD_043","MPRD_044","MPRD_045","MPRD_046","MPRD_047","MPRD_048","MPRD_049","MPRD_050","MPRD_051","MPRD_052","MPRD_053","MPRD_054","MPRD_055","MPRD_056","MPRD_057","MPRD_058","MPRD_059","MPRD_060","YPRD_01","YPRD_02","YPRD_03","YPRD_04","YPRD_05","YPRD_06","YPRD_07","YPRD_08","YPRD_09","YPRD_10","YPRD_11","YPRD_12","YPRD_13","YPRD_14","YPRD_15","YPRD_16","YPRD_17","YPRD_18","YPRD_19","YPRD_20","PRD_FYE2012","PRD_FYE2013","PRD_FYE2014","PRD_FYE2015","PRD_FYE2016","PRD_FYE2017","PRD_FYE2018","PRD_FYE2019","PRD_FYE2020","PRD_FYE2021","PRD_FYE2022","PRD_FYE2023","PRD_FYE2024","PRD_FYE2025","PRD_FYE2026","PRD_FYE2027","PRD_FYE2028","OIL_FYE2012","OIL_FYE2013","OIL_FYE2014","OIL_FYE2015","OIL_FYE2016","OIL_FYE2017","OIL_FYE2018","OIL_FYE2019","OIL_FYE2020","OIL_FYE2021","OIL_FYE2022","OIL_FYE2023","OIL_FYE2024","OIL_FYE2025","OIL_FYE2026","OIL_FYE2027","OIL_FYE2028","CND_FYE2012","CND_FYE2013","CND_FYE2014","CND_FYE2015","CND_FYE2016","CND_FYE2017","CND_FYE2018","CND_FYE2019","CND_FYE2020","CND_FYE2021","CND_FYE2022","CND_FYE2023","CND_FYE2024","CND_FYE2025","CND_FYE2026","CND_FYE2027","CND_FYE2028"]
[49886,202408,5979.8,8849.4,7872.3,7009.2,7370.8,7888.8,6536.3,6805.9,3581.1,4601.1000000000004,4102.8999999999996,3914.4,3689.5,3331.4,3295.4,3058.5,null,null,null,null,null,null,null,null,null,null,null,null,null,null,null,null,null,null,null,null,null,null,null,null,null,null,null,null,null,null,null,null,null,null,null,null,null,null,null,null,null,null,null,null,74512,13374.8,null,null,null,null,null,null,null,null,null,null,null,null,null,null,null,null,null,null,null,null,null,null,null,null,null,null,null,null,null,null,null,58312.5,29574.3,null,null,null,null,null,null,null,null,null,null,null,null,null,null,null,0,0,null,null,null,null,null,null,null,null,null,null,null,null,null,null,null,33,0]

{"sheet":"ADV_Profile_Gas","index":4,"n_rows":2,"n_cols":103,"rows_kept":2,"cut":false,"hidden":false,"merged":[]}
["WA_NUM","UWI","AREA_CODE","FORMTN_CODE","UWI_Order","FIRST_PROD_PERIOD","MADV_001","MADV_002","MADV_003","MADV_004","MADV_005","MADV_006","MADV_007","MADV_008","MADV_009","MADV_010","MADV_011","MADV_012","MADV_013","MADV_014","MADV_015","MADV_016","MADV_017","MADV_018","MADV_019","MADV_020","MADV_021","MADV_022","MADV_023","MADV_024","MADV_025","MADV_026","MADV_027","MADV_028","MADV_029","MADV_030","MADV_031","MADV_032","MADV_033","MADV_034","MADV_035","MADV_036","MADV_037","MADV_038","MADV_039","MADV_040","MADV_041","MADV_042","MADV_043","MADV_044","MADV_045","MADV_046","MADV_047","MADV_048","MADV_049","MADV_050","MADV_051","MADV_052","MADV_053","MADV_054","MADV_055","MADV_056","MADV_057","MADV_058","MADV_059","MADV_060","YADV_01","YADV_02","YADV_03","YADV_04","YADV_05","YADV_06","YADV_07","YADV_08","YADV_09","YADV_10","YADV_11","YADV_12","YADV_13","YADV_14","YADV_15","YADV_16","YADV_17","YADV_18","YADV_19","YADV_20","ADV_FYE2012","ADV_FYE2013","ADV_FYE2014","ADV_FYE2015","ADV_FYE2016","ADV_FYE2017","ADV_FYE2018","ADV_FYE2019","ADV_FYE2020","ADV_FYE2021","ADV_FYE2022","ADV_FYE2023","ADV_FYE2024","ADV_FYE2025","ADV_FYE2026","ADV_FYE2027","ADV_FYE2028"]
[49886,"207B090A094B1600",9022,5000,1,202408,308.23700000000002,294.98,262.41000000000003,233.64,245.69300000000001,262.08600000000001,234.27600000000001,223.14400000000001,166.56299999999999,148.423,137.68100000000001,128.34100000000001,119.01600000000001,111.047,106.303,101.95,0,0,0,0,0,0,0,0,0,0,0,0,0,0,0,0,0,0,0,0,0,0,0,0,0,0,0,0,0,0,0,0,0,0,0,0,0,0,0,0,0,0,0,0,218.703,109.63,0,0,0,0,0,0,0,0,0,0,0,0,0,0,0,0,0,0,0,0,0,0,0,0,0,0,0,0,0,0,0,255.869,125.955,0,0]

{"sheet":"FRAC_Summary","index":5,"n_rows":1,"n_cols":11,"rows_kept":1,"cut":false,"hidden":false,"merged":[]}
["WA_NUM","CO2_TONNES","NUM_CO2_FRACS","SLH_TONNES","NUM_SLH_FRACS","SLW_TONNES","NUM_SLW_FRACS","DGL_TONNES","NUM_DGL_FRACS","NES_TONNES","NUM_NES_FRACS"]

{"sheet":"DIR_SURVEY","index":6,"n_rows":2,"n_cols":3,"rows_kept":2,"cut":false,"hidden":false,"merged":[]}
["WA_NUM","TOTAL_M_DEPTH","MAX_TV_DEPTH"]
[49886,4379,1778.06]

{"sheet":"Drilling_Events","index":7,"n_rows":2,"n_cols":5,"rows_kept":2,"cut":false,"hidden":false,"merged":[]}
["WA_NUM","CLASS","SPUD_DATE","RIG_REL_DATE","REENTRY_DATE"]
[49886,"DV",20240410,20240421]

{"sheet":"FRAC_Descriptions","index":8,"n_rows":1,"n_cols":8,"rows_kept":1,"cut":false,"hidden":false,"merged":[]}
["UWI","Area_code","Formtn_code","Pool_seq","Wa_num","Compltn_Order","Compltn_date","Compltn_summry"]

{"sheet":"GAS_ANAL","index":9,"n_rows":2,"n_cols":26,"rows_kept":2,"cut":false,"hidden":false,"merged":[]}
["Wa_num","Uwi","Area_Code","Formtn_code","Sample_date","Sample_Order","H2_fractn","Helium_fractn","Co2_fractn","H2s_fractn","N2_fractn","C1_fractn","C2_fractn","C3_fractn","Ic4_fractn","Nc4_fractn","Ic5_fractn","Nc5_fractn","C6_fractn","C7_fractn","C8_fractn","C9_fractn","C10_fractn","Molclr_wt_of_c7","C5_ml_mol","Molclr_wt_of_gas"]
[49886,"207B090A094B1600",9022,5000,20240815,1,1E-4,0,1.4E-3,0,1.4E-3,0.8296,9.8299999999999998E-2,3.6999999999999998E-2,7.4000000000000003E-3,1.11E-2,3.7000000000000002E-3,3.5999999999999999E-3,3.3999999999999998E-3,3.0000000000000001E-3,0,0,0,107.7,null,20.2]

{"sheet":"ABANDON","index":10,"n_rows":1,"n_cols":13,"rows_kept":1,"cut":false,"hidden":false,"merged":[]}
["WA_NUM","UWI","ABANDONMENT_DATE","DRILLNG_EVENT_SEQ","PLUG_NUM","PLUG_TYPE","TOP_DEPTH","BASE_DEPTH","CEMENT_VOL","CEMENT_GRADE","BRIDGE_PLUG_SET_DEPTH","REMARKS","ORDER"]

{"sheet":"CASINGS","index":11,"n_rows":6,"n_cols":18,"rows_kept":6,"cut":false,"hidden":false,"merged":[]}
["WA_NUM","UWI","DRILLNG_EVENT_SEQ","CASING_SHOE_DEPTH","CASING_GRADE_CODE","CASING_SIZE","CEMENT_CLASS_CODE","CEMENT_GRADE","CASING_LINER_TOP_DEPTH","CASING_LINER_BASE_DEPTH","CASING_TYPE","CASING_JOINT_QTY","CASING_COMMENTS","CEMENT_VOL","CEMENT_RETURNS_TO_SURF","CASING_WEIGHT","CASING_DATE","ORDER"]
[49886,"207B090A094B1600",0,4360.54,"TN110S",114.3,"G",null,null,null,"PROD",308,null,5.2,null,22.47,20240421,1]
[49886,"207B090A094B1600",0,4360.54,"TN110S",114.3,"A",null,null,null,"PROD",308,null,22,null,22.47,20240421,2]
[49886,"207B090A094B1600",0,4360.54,"TN110S",114.3,"UNC",null,null,null,"PROD",308,null,null,null,22.47,20240421,3]
[49886,"207B090A094B1600",0,616.38,"L80-IC",177.8,"C",null,null,null,"SURF",43,null,26,null,34.229999999999997,20240411,4]
[49886,"207B090A094B1600",0,20,"ASTM A252 GRADE 3",406.4,"C",null,null,null,"COND",2,null,7,null,62.64,20240229,5]
{"$rows_left_out":1}
{"sheet":"PAY_ZONE","index":12,"n_rows":2,"n_cols":9,"rows_kept":2,"cut":false,"hidden":false,"merged":[]}
["WA_NUM","UWI","PAY_TYPE","MEAS_TOP_PAY_DEPTH","MEAS_BASE_PAY_DEPTH","POROSITY","SATURATION","LITHOLOGY","POSITION"]
[49886,"207B090A094B1600",null,1967.4,4352,null,null,null,1]

{"sheet":"CODES","index":13,"n_rows":788,"n_cols":7,"rows_kept":788,"cut":false,"hidden":false,"merged":[]}
["DB_AREA_CODE"]
["AREA_CODE","AREA_DESC",null,"FORM_CODE","FORM_DESC"]
[0,"CLIENT CLASSIFIED",null,40,"CENOZOIC"]
[50,"ADSETT",null,50,"QUATERNARY"]
[100,"AIRPORT",null,60,"PLEISTOCENE"]
[200,"AITKEN CREEK",null,70,"CAPE BALL"]
{"$rows_left_out":783}
{"sheet":"DBS_Location","index":14,"n_rows":202,"n_cols":78,"rows_kept":202,"cut":false,"hidden":false,"merged":[[111,0,113,4],[114,0,116,4],[0,1,0,12],[0,13,16,13],[2,4,2,12],[4,4,4,12],[5,4,5,8]]}
[null,"Location of BCER Source Database",null,null,null,null,null,null,null,null,null,null,null,null,null,null,null,null,null,null,null,null,null,null,null,null,null,null,null,null,null,null,"Source Database",{"$f":"$E$3&IF(AND(RIGHT($E$3,1)<>\"\\\",RIGHT($E$3,1)<>\"/\"),\"\\\",\"\")&$E$5","v":"c:\\users\\offic\\Downloads\\DBS_BCER_Data_Most_Recent.accdb"}]
[null,null,null,"Source Database",null,null,null,null,null,null,null,null,null,null,null,null,null,null,null,null,null,null,null,null,null,null,null,null,null,null,null,null,"Source Database",{"$f":"$E$9&IF(AND(RIGHT($E$9,1)<>\"\\\",RIGHT($E$9,1)<>\"/\"),\"\\\",\"\")&$E$11","v":"\\"},null,null,null,null,null,null,null,null,null,null,null,null,null,null,null,null,null,null,"Trial Version - Not Registered",null,null,null,null,null,null,null,null,null,null,null,null,null,null,null,null,null,null,null,null,null,null,null,"Ent_Name","Ent_ID"]
[null,null,null,"Directory","c:\\users\\offic\\Downloads\\",null,null,null,null,null,null,null,null,null,null,null,null,null,null,null,null,null,null,null,null,null,null,null,null,null,null,null,null,null,null,null,null,null,null,null,null,null,null,null,null,null,null,null,null,null,null,null,null,null,null,null,null,null,null,null,null,null,null,null,null,null,null,null,null,null,null,null,null,null,null,null,{"$f":"IF(#REF!=\"\",\"\",#REF!)","v":{"$error":"#REF!"}},{"$f":"IF(#REF!=\"\",\"\",#REF!)","v":{"$error":"#REF!"}}]
[null,null,null,null,null,null,null,null,null,null,null,null,null,null,null,null,null,null,null,null,null,null,null,null,null,null,null,null,null,null,null,null,null,null,null,null,null,null,null,null,null,null,null,null,null,null,null,null,null,null,null,null,null,null,null,null,null,null,null,null,null,null,null,null,null,null,null,null,null,null,null,null,null,null,null,null,{"$f":"IF(#REF!=\"\",\"\",#REF!)","v":{"$error":"#REF!"}},{"$f":"IF(#REF!=\"\",\"\",#REF!)","v":{"$error":"#REF!"}}]
[null,null,null,"Name","DBS_BCER_Data_Most_Recent.accdb",null,null,null,null,null,null,null,null,null,null,null,null,null,null,null,null,null,null,null,null,null,null,null,null,null,null,null,"OC",null,null,null,null,null,null,null,null,null,null,null,null,null,null,null,null,null,null,null,"Trial Version - Not Registered",null,null,null,null,null,null,null,null,null,null,null,null,null,null,null,null,null,null,null,null,null,null,null,{"$f":"IF(#REF!=\"\",\"\",#REF!)","v":{"$error":"#REF!"}},{"$f":"IF(#REF!=\"\",\"\",#REF!)","v":{"$error":"#REF!"}}]
[null,null,null,null,null,null,null,null,null,null,null,null,null,null,null,null,null,null,null,null,null,null,null,null,null,null,null,null,null,null,null,null,null,null,null,null,null,null,null,null,null,null,null,null,null,null,null,null,null,null,null,null,null,null,null,null,null,null,null,null,null,null,null,null,null,null,null,null,null,null,null,null,null,null,null,null,{"$f":"IF(#REF!=\"\",\"\",#REF!)","v":{"$error":"#REF!"}},{"$f":"IF(#REF!=\"\",\"\",#REF!)","v":{"$error":"#REF!"}}]
{"$rows_left_out":197}
{"sheet":"Source","index":15,"n_rows":2,"n_cols":5,"rows_kept":2,"cut":false,"hidden":false,"merged":[]}
["Author_Name","Author_email","Source_Agency","Source_Website","Data_Current_To"]
["George Macauley","office@macauley.ca","British Columbia Energy Regulator","www.bc-er.ca","November 2025"]

{"sheet":"Search","index":16,"n_rows":15388,"n_cols":8,"rows_kept":15388,"cut":false,"hidden":false,"merged":[]}
[1,{"$f":"IF(ISERROR(VLOOKUP($E$1+$A1-1,LU_Search_Main,2,0)),\"\",VLOOKUP($E$1+$A1-1,LU_Search_Main,2,0))","v":49886},{"$f":"IF($B1=\"\",\"\",VLOOKUP($E$1+$A1-1,LU_Search_Main,2)&\" - \"&VLOOKUP($E$1+$A1-1,LU_Search_Main,3))","v":"49886 - TOURMALINE  HZ TOWN C-G002-G/094-B-16"},"Start Position",{"$f":"SUM($E$2:$E21)","v":1},{"$f":"Summary!$E$2","v":"First 25 Wells"}]
[2,34329,"34329 - TOURMALINE  HZ NIG CREEK WEST A- 073-D/094-H-04",null,{"$f":"IF($F$1=$F2,1,0)","v":1},{"$f":"Summary!$CE$2","v":"First 25 Wells"},null,"SQL code"]
[3,34330,"34330 - TOURMALINE  HZ NIG CREEK WEST A-A073-D/094-H-04",null,{"$f":"IF($F$1=$F3,26,0)","v":0},{"$f":"Summary!$CE$3","v":"Wells 26-50"},null,"SELECT WA_NUM,WELL_NAME from WELL_SEARCH_INDEX where (OPERATOR like '%Tour%' or OPER_ABRV like '%Tour%')  and SPUD_MON >= 202401 and SPUD_MON <= 202511  and SURF_LAT_DEC_DEG >= 57 and SURF_LON_DEC_DEG >= -124 and SURF_LAT_DEC_DEG <= 60 and SURF_LON_DEC_DEG <= -116  order by GAS_PRODN_3_YR desc, WA_NUM desc; "]
[4,36126,"36126 - TOURMALINE  HZ AITKEN CREEK NORTH C- 065-D/094-H-04",null,{"$f":"IF($F$1=$F4,51,0)","v":0},{"$f":"Summary!$CE$4","v":"Wells 51-75"}]
[5,34331,"34331 - TOURMALINE  HZ NIG CREEK WEST A-B073-D/094-H-04",null,{"$f":"IF($F$1=$F5,76,0)","v":0},{"$f":"Summary!$CE$5","v":"Wells 76-100"}]
[6,36127,"36127 - TOURMALINE  HZ AITKEN CREEK NORTH C-A065-D/094-H-04",null,{"$f":"IF($F$1=$F6,101,0)","v":0},{"$f":"Summary!$CE$6","v":"Wells 101-125"}]
{"$rows_left_out":15382}